Reaction Details
TargetSialidase
LigandBDBM50278394
Substrate/Competitorn/a
Meas. Tech.ChEMBL_565687 (CHEMBL960045)
Ki 2230±n/a nM
Citation Ryu, YBCurtis-Long, MJLee, JWKim, JHKim, JYKang, KYLee, WSPark, KH Characteristic of neuraminidase inhibitory xanthones from Cudrania tricuspidata. Bioorg Med Chem17:2744-50 (2009) 
 
Sialidase
Name:Sialidase
Type:PROTEIN
Mol. Mass.:42808.79
Organism:Clostridium perfringens
Description:ChEMBL_991336
Residue:382
BDBM50278394
NameBDBM50278394
Synonyms:CHEMBL469813 | Cudratricusxanthone F
TypeSmall organic molecule
Emp. Form.C24H28O6
Mol. Mass.412.4755
SMILES[#6]-[#8]-[#6]-1=[#6](-[#6]-2-[#8]-c3cc(-[#8])c(-[#8])c(-[#6]\[#6]=[#6](/[#6])-[#6])c3-[#6](=O)-[#6]-2-[#6](=O)-[#6]-1)C([#6])([#6])[#6]=[#6]