Reaction Details
TargetCarbonic anhydrase 2
LigandBDBM50278844
Substrate/Competitorn/a
Meas. Tech.ChEMBL_501258 (CHEMBL976160)
Ki 5.6±n/a nM
Citation Singer, MLopez, MBornaghi, LFInnocenti, AVullo, DSupuran, CTPoulsen, SA Inhibition of carbonic anhydrase isozymes with benzene sulfonamides incorporating thio, sulfinyl and sulfonyl glycoside moieties. Bioorg Med Chem Lett19:2273-6 (2009) 
 
Carbonic anhydrase 2
Name:Carbonic anhydrase 2
Type:Enzyme
Mol. Mass.:29250.71
Organism:Homo sapiens (Human)
Description:P00918
Residue:260
BDBM50278844
NameBDBM50278844
Synonyms:4-(4-{[beta-D-glucopyranosyl]thiomethyl}-1-H-1,2,3-triazol-1-yl)benzenesulfonamide | CHEMBL498750
TypeSmall organic molecule
Emp. Form.C15H20N4O7S2
Mol. Mass.432.472
SMILESNS(=O)(=O)c1ccc(cc1)-n1cc(CS[C@@H]2O[C@H](CO)[C@@H](O)[C@H](O)[C@H]2O)nn1