Reaction Details
TargetCarbonic anhydrase 9
LigandBDBM50278781
Substrate/Competitorn/a
Meas. Tech.ChEMBL_501259 (CHEMBL976161)
Ki 8.6±n/a nM
Citation Singer, MLopez, MBornaghi, LFInnocenti, AVullo, DSupuran, CTPoulsen, SA Inhibition of carbonic anhydrase isozymes with benzene sulfonamides incorporating thio, sulfinyl and sulfonyl glycoside moieties. Bioorg Med Chem Lett19:2273-6 (2009) 
 
Carbonic anhydrase 9
Name:Carbonic anhydrase 9
Type:Enzyme
Mol. Mass.:49669.03
Organism:Homo sapiens (Human)
Description:Catalytic domain of human cloned isozyme was used in the assay
Residue:459
BDBM50278781
NameBDBM50278781
Synonyms:4-(4-{[2',3',4',6'-Tetra-O-acetyl-beta-D-galactopyranosyl]thiomethyl}-1-H-1,2,3-triazol-1-yl)benzenesulfonamide | CHEMBL517088
TypeSmall organic molecule
Emp. Form.C23H28N4O11S2
Mol. Mass.600.619
SMILESCC(=O)OC[C@H]1O[C@@H](SCc2cn(nn2)-c2ccc(cc2)S(N)(=O)=O)[C@H](OC(C)=O)[C@@H](OC(C)=O)[C@H]1OC(C)=O