Reaction Details
TargetCarbonic anhydrase 1
LigandBDBM50278845
Substrate/Competitorn/a
Meas. Tech.ChEMBL_501257 (CHEMBL976159)
Ki 102±n/a nM
Citation Singer, MLopez, MBornaghi, LFInnocenti, AVullo, DSupuran, CTPoulsen, SA Inhibition of carbonic anhydrase isozymes with benzene sulfonamides incorporating thio, sulfinyl and sulfonyl glycoside moieties. Bioorg Med Chem Lett19:2273-6 (2009) 
 
Carbonic anhydrase 1
Name:Carbonic anhydrase 1
Type:Enzyme
Mol. Mass.:28873.37
Organism:Homo sapiens (Human)
Description:P00915
Residue:261
BDBM50278845
NameBDBM50278845
Synonyms:4-(4-{[beta-D-glucopyranosyl]sulfinylmethyl}-1-H-1,2,3-triazol-1-yl)benzenesulfonamide | CHEMBL525195
TypeSmall organic molecule
Emp. Form.C15H20N4O8S2
Mol. Mass.448.471
SMILESNS(=O)(=O)c1ccc(cc1)-n1cc(CS(=O)[C@@H]2O[C@H](CO)[C@@H](O)[C@H](O)[C@H]2O)nn1