Reaction Details
TargetInsulin-like growth factor 1 receptor
LigandBDBM50265846
Substrate/Competitorn/a
Meas. Tech.ChEMBL_540379 (CHEMBL1025722)
IC50 1.3±n/a nM
Citation Chamberlain, SDRedman, AMPatnaik, SBrickhouse, KChew, YCDeanda, FGerding, RLei, HMoorthy, GPatrick, MStevens, KLWilson, JWBrad Shotwell, J Optimization of a series of 4,6-bis-anilino-1H-pyrrolo[2,3-d]pyrimidine inhibitors of IGF-1R: elimination of an acid-mediated decomposition pathway. Bioorg Med Chem Lett19:373-7 (2008) 
 
Insulin-like growth factor 1 receptor
Name:Insulin-like growth factor 1 receptor
Type:Protein
Mol. Mass.:154776.79
Organism:Homo sapiens (Human)
Description:P08069
Residue:1367
BDBM50265846
NameBDBM50265846
Synonyms:3-(2-(2-methoxy-4-(1-propylpiperidin-4-yl)phenylamino)-7H-pyrrolo[2,3-d]pyrimidin-4-ylamino)thiophene-2-carboxamide | CHEMBL515846
TypeSmall organic molecule
Emp. Form.C26H31N7O2S
Mol. Mass.505.635
SMILESCCCN1CCC(CC1)c1ccc(Nc2nc(Nc3ccsc3C(N)=O)c3cc[nH]c3n2)c(OC)c1