Reaction Details
TargetHistamine H3 receptor
LigandBDBM50240514
Substrate/Competitorn/a
Meas. Tech.ChEMBL_540492 (CHEMBL1030596)
Ki>1000±n/a nM
Citation von Coburg, YKottke, TWeizel, LLigneau, XStark, H Potential utility of histamine H3 receptor antagonist pharmacophore in antipsychotics. Bioorg Med Chem Lett19:538-42 (2008) 
 
Histamine H3 receptor
Name:Histamine H3 receptor
Type:G Protein-Coupled Receptor (GPCR)
Mol. Mass.:48691.47
Organism:Homo sapiens (Human)
Description:Binding assays were using CHO cells stably expressing hH3R receptors.
Residue:445
BDBM50240514
NameBDBM50240514
Synonyms:(3Z)-3-(2-chloro-9H-thioxanthen-9-ylidene)-N,N-dimethylpropan-1-amine (Z)-chlorprothixene CHLORPROTHIXENE | cis-2-Chloro-9-(3-dimethylaminopropylidene)thioxanthene
TypeSmall organic molecule
Emp. Form.C18H18ClNS
Mol. Mass.315.86
SMILESCN(C)CC\C=C1\c2ccccc2Sc2ccc(Cl)cc12