Reaction Details
TargetHistamine H3 receptor
LigandBDBM50277100
Substrate/Competitorn/a
Meas. Tech.ChEMBL_540492 (CHEMBL1030596)
Ki 0.042±n/a nM
Citation von Coburg, YKottke, TWeizel, LLigneau, XStark, H Potential utility of histamine H3 receptor antagonist pharmacophore in antipsychotics. Bioorg Med Chem Lett19:538-42 (2008) 
 
Histamine H3 receptor
Name:Histamine H3 receptor
Type:G Protein-Coupled Receptor (GPCR)
Mol. Mass.:48691.47
Organism:Homo sapiens (Human)
Description:Binding assays were using CHO cells stably expressing hH3R receptors.
Residue:445
BDBM50277100
NameBDBM50277100
Synonyms:4-(3-Piperidin-1-yl-propoxy)-benzoic acid 2-{4-[3-(2-trifluoromethyl-phenothiazin-10-yl)-propyl]-piperazin-1-yl}-ethyl ester | CHEMBL455288
TypeSmall organic molecule
Emp. Form.C37H45F3N4O3S
Mol. Mass.682.838
SMILESFC(F)(F)c1ccc2Sc3ccccc3N(CCCN3CCN(CCOC(=O)c4ccc(OCCCN5CCCCC5)cc4)CC3)c2c1