Reaction Details
TargetD(2) dopamine receptor
LigandBDBM50240514
Substrate/Competitorn/a
Meas. Tech.ChEMBL_540496 (CHEMBL1030600)
Ki 2.96±n/a nM
Citation von Coburg, YKottke, TWeizel, LLigneau, XStark, H Potential utility of histamine H3 receptor antagonist pharmacophore in antipsychotics. Bioorg Med Chem Lett19:538-42 (2008) 
 
D(2) dopamine receptor
Name:D(2) dopamine receptor
Type:Cell-surface receptors
Mol. Mass.:50647.10
Organism:Homo sapiens (Human)
Description:P14416
Residue:443
BDBM50240514
NameBDBM50240514
Synonyms:(3Z)-3-(2-chloro-9H-thioxanthen-9-ylidene)-N,N-dimethylpropan-1-amine (Z)-chlorprothixene CHLORPROTHIXENE | cis-2-Chloro-9-(3-dimethylaminopropylidene)thioxanthene
TypeSmall organic molecule
Emp. Form.C18H18ClNS
Mol. Mass.315.86
SMILESCN(C)CC\C=C1\c2ccccc2Sc2ccc(Cl)cc12