Reaction Details
TargetD(3) dopamine receptor
LigandBDBM50240514
Substrate/Competitorn/a
Meas. Tech.ChEMBL_540497 (CHEMBL1030601)
Ki 4.56±n/a nM
Citation von Coburg, YKottke, TWeizel, LLigneau, XStark, H Potential utility of histamine H3 receptor antagonist pharmacophore in antipsychotics. Bioorg Med Chem Lett19:538-42 (2008) 
 
D(3) dopamine receptor
Name:D(3) dopamine receptor
Type:n/a
Mol. Mass.:44243.43
Organism:Homo sapiens (Human)
Description:n/a
Residue:400
BDBM50240514
NameBDBM50240514
Synonyms:(3Z)-3-(2-chloro-9H-thioxanthen-9-ylidene)-N,N-dimethylpropan-1-amine (Z)-chlorprothixene CHLORPROTHIXENE | cis-2-Chloro-9-(3-dimethylaminopropylidene)thioxanthene
TypeSmall organic molecule
Emp. Form.C18H18ClNS
Mol. Mass.315.86
SMILESCN(C)CC\C=C1\c2ccccc2Sc2ccc(Cl)cc12