Reaction Details
TargetD(1A) dopamine receptor
LigandBDBM50240514
Substrate/Competitorn/a
Meas. Tech.ChEMBL_540494 (CHEMBL1030598)
Ki 18±n/a nM
Citation von Coburg, YKottke, TWeizel, LLigneau, XStark, H Potential utility of histamine H3 receptor antagonist pharmacophore in antipsychotics. Bioorg Med Chem Lett19:538-42 (2008) 
 
D(1A) dopamine receptor
Name:D(1A) dopamine receptor
Type:Enzyme
Mol. Mass.:49303.43
Organism:Homo sapiens (Human)
Description:P21728
Residue:446
BDBM50240514
NameBDBM50240514
Synonyms:(3Z)-3-(2-chloro-9H-thioxanthen-9-ylidene)-N,N-dimethylpropan-1-amine (Z)-chlorprothixene CHLORPROTHIXENE | cis-2-Chloro-9-(3-dimethylaminopropylidene)thioxanthene
TypeSmall organic molecule
Emp. Form.C18H18ClNS
Mol. Mass.315.86
SMILESCN(C)CC\C=C1\c2ccccc2Sc2ccc(Cl)cc12