Reaction Details
TargetHistamine H3 receptor
LigandBDBM50269054
Substrate/Competitorn/a
Meas. Tech.ChEMBL_523452 (CHEMBL1008304)
EC50 4±n/a nM
Citation Pierson, PDFettes, AFreichel, CGatti-McArthur, SHertel, CHuwyler, JMohr, PNakagawa, TNettekoven, MPlancher, JMRaab, SRichter, HRoche, ORodríguez Sarmiento, RMSchmitt, MSchuler, FTakahashi, TTaylor, SUllmer, CWiegand, R 5-hydroxyindole-2-carboxylic acid amides: novel histamine-3 receptor inverse agonists for the treatment of obesity. J Med Chem52:3855-68 (2009) 
 
Histamine H3 receptor
Name:Histamine H3 receptor
Type:G Protein-Coupled Receptor (GPCR)
Mol. Mass.:48691.47
Organism:Homo sapiens (Human)
Description:Binding assays were using CHO cells stably expressing hH3R receptors.
Residue:445
BDBM50269054
NameBDBM50269054
Synonyms:(4,4-difluoropiperidin-1-yl)(5-(1-isopropylpiperidin-4-yloxy)-1-(2,2,2-trifluoroethyl)-1H-indol-2-yl)methanone | CHEMBL524077
TypeSmall organic molecule
Emp. Form.C24H30F5N3O2
Mol. Mass.487.5059
SMILESCC(C)N1CCC(CC1)Oc1ccc2n(CC(F)(F)F)c(cc2c1)C(=O)N1CCC(F)(F)CC1