Reaction Details
TargetHistamine H3 receptor
LigandBDBM50269096
Substrate/Competitorn/a
Meas. Tech.ChEMBL_523452 (CHEMBL1008304)
EC50 7±n/a nM
Citation Pierson, PDFettes, AFreichel, CGatti-McArthur, SHertel, CHuwyler, JMohr, PNakagawa, TNettekoven, MPlancher, JMRaab, SRichter, HRoche, ORodríguez Sarmiento, RMSchmitt, MSchuler, FTakahashi, TTaylor, SUllmer, CWiegand, R 5-hydroxyindole-2-carboxylic acid amides: novel histamine-3 receptor inverse agonists for the treatment of obesity. J Med Chem52:3855-68 (2009) 
 
Histamine H3 receptor
Name:Histamine H3 receptor
Type:G Protein-Coupled Receptor (GPCR)
Mol. Mass.:48691.47
Organism:Homo sapiens (Human)
Description:Binding assays were using CHO cells stably expressing hH3R receptors.
Residue:445
BDBM50269096
NameBDBM50269096
Synonyms:1-(2-(4,4-difluoropiperidine-1-carbonyl)-5-(1-isopropylpiperidin-4-yloxy)-1H-indol-1-yl)ethanone | CHEMBL496080
TypeSmall organic molecule
Emp. Form.C24H31F2N3O3
Mol. Mass.447.518
SMILESCC(C)N1CCC(CC1)Oc1ccc2n(C(C)=O)c(cc2c1)C(=O)N1CCC(F)(F)CC1