Reaction Details
TargetHistamine H3 receptor
LigandBDBM50268815
Substrate/Competitorn/a
Meas. Tech.ChEMBL_523447 (CHEMBL1008299)
Ki 2±n/a nM
Citation Pierson, PDFettes, AFreichel, CGatti-McArthur, SHertel, CHuwyler, JMohr, PNakagawa, TNettekoven, MPlancher, JMRaab, SRichter, HRoche, ORodríguez Sarmiento, RMSchmitt, MSchuler, FTakahashi, TTaylor, SUllmer, CWiegand, R 5-hydroxyindole-2-carboxylic acid amides: novel histamine-3 receptor inverse agonists for the treatment of obesity. J Med Chem52:3855-68 (2009) 
 
Histamine H3 receptor
Name:Histamine H3 receptor
Type:G Protein-Coupled Receptor (GPCR)
Mol. Mass.:48691.47
Organism:Homo sapiens (Human)
Description:Binding assays were using CHO cells stably expressing hH3R receptors.
Residue:445
BDBM50268815
NameBDBM50268815
Synonyms:(R)-4'-(3-(3-(dimethylamino)pyrrolidin-1-yl)propoxy)-3',5'-difluorobiphenyl-4-carbonitrile CHEMBL498228
TypeSmall organic molecule
Emp. Form.C22H25F2N3O
Mol. Mass.385.4502
SMILESCN(C)[C@@H]1CCN(CCCOc2c(F)cc(cc2F)-c2ccc(cc2)C#N)C1