Reaction Details
TargetHistamine H3 receptor
LigandBDBM50268949
Substrate/Competitorn/a
Meas. Tech.ChEMBL_523444 (CHEMBL1008296)
Ki 5±n/a nM
Citation Pierson, PDFettes, AFreichel, CGatti-McArthur, SHertel, CHuwyler, JMohr, PNakagawa, TNettekoven, MPlancher, JMRaab, SRichter, HRoche, ORodríguez Sarmiento, RMSchmitt, MSchuler, FTakahashi, TTaylor, SUllmer, CWiegand, R 5-hydroxyindole-2-carboxylic acid amides: novel histamine-3 receptor inverse agonists for the treatment of obesity. J Med Chem52:3855-68 (2009) 
 
Histamine H3 receptor
Name:Histamine H3 receptor
Type:G Protein-Coupled Receptor (GPCR)
Mol. Mass.:48691.47
Organism:Homo sapiens (Human)
Description:Binding assays were using CHO cells stably expressing hH3R receptors.
Residue:445
BDBM50268949
NameBDBM50268949
Synonyms:(5-(1-isopropylpiperidin-4-yloxy)-1H-indol-2-yl)(morpholino)methanone | CHEMBL495612
TypeSmall organic molecule
Emp. Form.C21H29N3O3
Mol. Mass.371.4733
SMILESCC(C)N1CCC(CC1)Oc1ccc2[nH]c(cc2c1)C(=O)N1CCOCC1