Reaction Details
TargetHistamine H3 receptor
LigandBDBM50268997
Substrate/Competitorn/a
Meas. Tech.ChEMBL_523444 (CHEMBL1008296)
Ki 2±n/a nM
Citation Pierson, PDFettes, AFreichel, CGatti-McArthur, SHertel, CHuwyler, JMohr, PNakagawa, TNettekoven, MPlancher, JMRaab, SRichter, HRoche, ORodríguez Sarmiento, RMSchmitt, MSchuler, FTakahashi, TTaylor, SUllmer, CWiegand, R 5-hydroxyindole-2-carboxylic acid amides: novel histamine-3 receptor inverse agonists for the treatment of obesity. J Med Chem52:3855-68 (2009) 
 
Histamine H3 receptor
Name:Histamine H3 receptor
Type:G Protein-Coupled Receptor (GPCR)
Mol. Mass.:48691.47
Organism:Homo sapiens (Human)
Description:Binding assays were using CHO cells stably expressing hH3R receptors.
Residue:445
BDBM50268997
NameBDBM50268997
Synonyms:(4,4-Difluoropiperidin-1-yl)[5-(1-isopropyl-piperidin-4-yloxy)-1H-indol-2-yl]methanone | CHEMBL496816
TypeSmall organic molecule
Emp. Form.C22H29F2N3O2
Mol. Mass.405.4814
SMILESCC(C)N1CCC(CC1)Oc1ccc2[nH]c(cc2c1)C(=O)N1CCC(F)(F)CC1