Reaction Details
TargetHistamine H3 receptor
LigandBDBM50268946
Substrate/Competitorn/a
Meas. Tech.ChEMBL_523445 (CHEMBL1008297)
Ki 91±n/a nM
Citation Pierson, PDFettes, AFreichel, CGatti-McArthur, SHertel, CHuwyler, JMohr, PNakagawa, TNettekoven, MPlancher, JMRaab, SRichter, HRoche, ORodríguez Sarmiento, RMSchmitt, MSchuler, FTakahashi, TTaylor, SUllmer, CWiegand, R 5-hydroxyindole-2-carboxylic acid amides: novel histamine-3 receptor inverse agonists for the treatment of obesity. J Med Chem52:3855-68 (2009) 
 
Histamine H3 receptor
Name:Histamine H3 receptor
Type:G Protein-Coupled Receptor (GPCR)
Mol. Mass.:48607.98
Organism:Rattus norvegicus (rat)
Description:n/a
Residue:445
BDBM50268946
NameBDBM50268946
Synonyms:CHEMBL522555 | morpholino(5-(3-(piperidin-1-yl)propoxy)-1H-indol-2-yl)methanone
TypeSmall organic molecule
Emp. Form.C21H29N3O3
Mol. Mass.371.4733
SMILESO=C(N1CCOCC1)c1cc2cc(OCCCN3CCCCC3)ccc2[nH]1