Reaction Details
TargetHistamine H3 receptor
LigandBDBM50268947
Substrate/Competitorn/a
Meas. Tech.ChEMBL_523445 (CHEMBL1008297)
Ki 2±n/a nM
Citation Pierson, PDFettes, AFreichel, CGatti-McArthur, SHertel, CHuwyler, JMohr, PNakagawa, TNettekoven, MPlancher, JMRaab, SRichter, HRoche, ORodríguez Sarmiento, RMSchmitt, MSchuler, FTakahashi, TTaylor, SUllmer, CWiegand, R 5-hydroxyindole-2-carboxylic acid amides: novel histamine-3 receptor inverse agonists for the treatment of obesity. J Med Chem52:3855-68 (2009) 
 
Histamine H3 receptor
Name:Histamine H3 receptor
Type:G Protein-Coupled Receptor (GPCR)
Mol. Mass.:48607.98
Organism:Rattus norvegicus (rat)
Description:n/a
Residue:445
BDBM50268947
NameBDBM50268947
Synonyms:(5-(1-cyclopropylpiperidin-4-yloxy)-1H-indol-2-yl)(morpholino)methanone | CHEMBL496008
TypeSmall organic molecule
Emp. Form.C21H27N3O3
Mol. Mass.369.4574
SMILESO=C(N1CCOCC1)c1cc2cc(OC3CCN(CC3)C3CC3)ccc2[nH]1