Reaction Details
TargetHistamine H3 receptor
LigandBDBM50269055
Substrate/Competitorn/a
Meas. Tech.ChEMBL_523445 (CHEMBL1008297)
Ki 5±n/a nM
Citation Pierson, PDFettes, AFreichel, CGatti-McArthur, SHertel, CHuwyler, JMohr, PNakagawa, TNettekoven, MPlancher, JMRaab, SRichter, HRoche, ORodríguez Sarmiento, RMSchmitt, MSchuler, FTakahashi, TTaylor, SUllmer, CWiegand, R 5-hydroxyindole-2-carboxylic acid amides: novel histamine-3 receptor inverse agonists for the treatment of obesity. J Med Chem52:3855-68 (2009) 
 
Histamine H3 receptor
Name:Histamine H3 receptor
Type:G Protein-Coupled Receptor (GPCR)
Mol. Mass.:48607.98
Organism:Rattus norvegicus (rat)
Description:n/a
Residue:445
BDBM50269055
NameBDBM50269055
Synonyms:(4,4-Difluoropiperidin-1-yl)[1-isopropyl-5-(1-isopropylpiperidin-4-yloxy)-1H-indol-2-yl]methanone | CHEMBL497031
TypeSmall organic molecule
Emp. Form.C25H35F2N3O2
Mol. Mass.447.5611
SMILESCC(C)N1CCC(CC1)Oc1ccc2n(C(C)C)c(cc2c1)C(=O)N1CCC(F)(F)CC1