Reaction Details
TargetHistamine H3 receptor
LigandBDBM50269097
Substrate/Competitorn/a
Meas. Tech.ChEMBL_523445 (CHEMBL1008297)
Ki 4±n/a nM
Citation Pierson, PDFettes, AFreichel, CGatti-McArthur, SHertel, CHuwyler, JMohr, PNakagawa, TNettekoven, MPlancher, JMRaab, SRichter, HRoche, ORodríguez Sarmiento, RMSchmitt, MSchuler, FTakahashi, TTaylor, SUllmer, CWiegand, R 5-hydroxyindole-2-carboxylic acid amides: novel histamine-3 receptor inverse agonists for the treatment of obesity. J Med Chem52:3855-68 (2009) 
 
Histamine H3 receptor
Name:Histamine H3 receptor
Type:G Protein-Coupled Receptor (GPCR)
Mol. Mass.:48607.98
Organism:Rattus norvegicus (rat)
Description:n/a
Residue:445
BDBM50269097
NameBDBM50269097
Synonyms:(4,4-difluoropiperidin-1-yl)(5-(1-isopropylpiperidin-4-yloxy)-1-(methylsulfonyl)-1H-indol-2-yl)methanone | CHEMBL495639
TypeSmall organic molecule
Emp. Form.C23H31F2N3O4S
Mol. Mass.483.572
SMILESCC(C)N1CCC(CC1)Oc1ccc2n(c(cc2c1)C(=O)N1CCC(F)(F)CC1)S(C)(=O)=O