Reaction Details
TargetMelanocortin receptor 5
LigandBDBM50268804
Substrate/Competitorn/a
Meas. Tech.ChEMBL_523579 (CHEMBL997229)
EC50<0.1±n/a nM
CommentsZero 20220115
Citation Qu, HCai, MMayorov, AVGrieco, PZingsheim, MTrivedi, DHruby, VJ Substitution of arginine with proline and proline derivatives in melanocyte-stimulating hormones leads to selectivity for human melanocortin 4 receptor. J Med Chem52:3627-35 (2009) 
 
Melanocortin receptor 5
Name:Melanocortin receptor 5
Type:Enzyme
Mol. Mass.:36612.92
Organism:Homo sapiens (Human)
Description:P33032
Residue:325
BDBM50268804
NameBDBM50268804
Synonyms:Ac-Tyr-Val-Nle-Gly-His-DPhe-Pro-Trp-Asp-Arg-Phe-Gly-NH2 | CHEMBL526334
TypeSmall organic molecule
Emp. Form.C76H99N19O16
Mol. Mass.1534.717
SMILESCCCC[C@H](NC(=O)[C@@H](NC(=O)[C@H](Cc1ccc(O)cc1)NC(C)=O)C(C)C)C(=O)NCC(=O)N[C@@H](Cc1cnc[nH]1)C(=O)N[C@H](Cc1ccccc1)C(=O)N1CCC[C@H]1C(=O)N[C@@H](Cc1c[nH]c2ccccc12)C(=O)N[C@@H](CC(O)=O)C(=O)N[C@@H](CCCN=C(N)N)C(=O)N[C@@H](Cc1ccccc1)C(=O)NCC(N)=O