Reaction Details
TargetMelanocyte-stimulating hormone receptor
LigandBDBM50268796
Substrate/Competitorn/a
Meas. Tech.ChEMBL_523572 (CHEMBL997222)
IC50 1.1±n/a nM
Citation Qu, HCai, MMayorov, AVGrieco, PZingsheim, MTrivedi, DHruby, VJ Substitution of arginine with proline and proline derivatives in melanocyte-stimulating hormones leads to selectivity for human melanocortin 4 receptor. J Med Chem52:3627-35 (2009) 
 
Melanocyte-stimulating hormone receptor
Name:Melanocyte-stimulating hormone receptor
Type:Enzyme
Mol. Mass.:34717.23
Organism:Homo sapiens (Human)
Description:Q01726
Residue:317
BDBM50268796
NameBDBM50268796
Synonyms:Ac-Nle-c[Asp-cis-4-guanidinyl-Pro-DPhe-Arg-Trp-Lys]-NH2 | CHEMBL524861
TypeSmall organic molecule
Emp. Form.C50H72N16O9
Mol. Mass.1041.2085
SMILESCCCC[C@H](NC(C)=O)C(=O)N[C@H]1CC(=O)NCCCC[C@H](NC(=O)[C@H](Cc2c[nH]c3ccccc23)NC(=O)[C@H](CCCN=C(N)N)NC(=O)[C@@H](Cc2ccccc2)NC(=O)[C@@H]2C[C@@H](CN2C1=O)N=C(N)N)C(N)=O