Reaction Details
TargetHeat shock protein HSP 90-beta
LigandBDBM50249912
Substrate/Competitorn/a
Meas. Tech.ChEMBL_498597 (CHEMBL1021924)
Kd 800±n/a nM
Citation Tian, ZQWang, ZMacMillan, KSZhou, YCarreras, CWMueller, TMyles, DCLiu, Y Potent cytotoxic C-11 modified geldanamycin analogues. J Med Chem52:3265-73 (2009) 
 
Heat shock protein HSP 90-beta
Name:Heat shock protein HSP 90-beta
Type:Molecular Chaperone
Mol. Mass.:83229.45
Organism:Homo sapiens (Human)
Description:P08238
Residue:724
BDBM50249912
NameBDBM50249912
Synonyms:11-O-Methyl-17-[2-(dimethylamino)ethyl]amino-17-demethoxygeldanamycin | CHEMBL506415
TypeSmall organic molecule
Emp. Form.C33H50N4O8
Mol. Mass.630.7721
SMILESCO[C@H]1C[C@H](C)Cc2c(O)c(NC(=O)C(C)=CC=C[C@H](OC)[C@@H](OC(N)=O)\C(C)=C\[C@H](C)[C@H]1OC)cc(O)c2N=CCN(C)C