Reaction Details
TargetCorticotropin releasing hormone receptor 2
LigandBDBM50293910
Substrate/Competitorn/a
Meas. Tech.ChEMBL_572724 (CHEMBL1030148)
IC50>10000±n/a nM
Citation Hartz, RAAhuja, VTRafalski, MSchmitz, WDBrenner, ABDenhart, DJDitta, JLDeskus, JAYue, EWArvanitis, AGLelas, SLi, YWMolski, TFWong, HGrace, JELentz, KALi, JLodge, NJZaczek, RCombs, APOlson, REMattson, RJBronson, JJMacor, JE In vitro intrinsic clearance-based optimization of N3-phenylpyrazinones as corticotropin-releasing factor-1 (CRF1) receptor antagonists. J Med Chem52:4161-72 (2009) 
 
Corticotropin releasing hormone receptor 2
Name:Corticotropin releasing hormone receptor 2
Synonyms:n/a
Type:PROTEIN
Mol. Mass.:47765.85
Organism:Sus scrofa
Description:ChEMBL_572724
Residue:411
BDBM50293910
NameBDBM50293910
TypeSmall organic molecule
Emp. Form.C16H14Cl3F2N3O2
Mol. Mass.424.657
SMILESC[C@@H](C1CC1)n1cc(Cl)nc(Nc2c(Cl)cc(OC(F)F)cc2Cl)c1=O