Reaction Details
TargetTyrosine-protein phosphatase non-receptor type 1
LigandBDBM50294525
Substrate/Competitorn/a
Meas. Tech.ChEMBL_575586 (CHEMBL1036431)
IC50 6860±n/a nM
Citation Seo, CSohn, JHAhn, JSYim, JHLee, HKOh, H Protein tyrosine phosphatase 1B inhibitory effects of depsidone and pseudodepsidone metabolites from the Antarctic lichen Stereocaulon alpinum. Bioorg Med Chem Lett19:2801-3 (2009) 
 
Tyrosine-protein phosphatase non-receptor type 1
Name:Tyrosine-protein phosphatase non-receptor type 1
Type:Protein phosphatase
Mol. Mass.:49963.76
Organism:Homo sapiens (Human)
Description:Human recombinant GST-fusion PTP1B (1-435).
Residue:435
BDBM50294525
NameBDBM50294525
Synonyms:3-butyl-7-(2,4-dihydroxy-6-pentylphenoxy)-3,5-dimethoxyisobenzofuran-1(3H)-one | CHEMBL550291
TypeSmall organic molecule
Emp. Form.C25H32O7
Mol. Mass.444.5174
SMILESCCCCCc1cc(O)cc(O)c1Oc1cc(OC)cc2c1C(=O)OC2(CCCC)OC