Reaction Details
TargetTyrosine-protein phosphatase non-receptor type 1
LigandBDBM50294527
Substrate/Competitorn/a
Meas. Tech.ChEMBL_575586 (CHEMBL1036431)
IC50 2480±n/a nM
Citation Seo, CSohn, JHAhn, JSYim, JHLee, HKOh, H Protein tyrosine phosphatase 1B inhibitory effects of depsidone and pseudodepsidone metabolites from the Antarctic lichen Stereocaulon alpinum. Bioorg Med Chem Lett19:2801-3 (2009) 
 
Tyrosine-protein phosphatase non-receptor type 1
Name:Tyrosine-protein phosphatase non-receptor type 1
Type:Protein phosphatase
Mol. Mass.:49963.76
Organism:Homo sapiens (Human)
Description:Human recombinant GST-fusion PTP1B (1-435).
Residue:435
BDBM50294527
NameBDBM50294527
Synonyms:3-(1-butyl-1,6-dimethoxy-3-oxo-1,3-dihydroisobenzofuran-4-yloxy)-4,6-dihydroxy-2-pentylbenzoic acid | CHEMBL558886
TypeSmall organic molecule
Emp. Form.C26H32O9
Mol. Mass.488.5269
SMILESCCCCCc1c(Oc2cc(OC)cc3c2C(=O)OC3(CCCC)OC)c(O)cc(O)c1C(O)=O