Reaction Details
TargetGlutamate receptor ionotropic, kainate 1
LigandBDBM50126763
Substrate/Competitorn/a
Meas. Tech.ChEMBL_573947 (CHEMBL1059439)
Ki 2.13±n/a nM
Citation Clausen, RPNaur, PKristensen, ASGreenwood, JRStrange, MBräuner-Osborne, HJensen, AANielsen, ASGeneser, URinggaard, LMNielsen, BPickering, DSBrehm, LGajhede, MKrogsgaard-Larsen, PKastrup, JS The glutamate receptor GluR5 agonist (S)-2-amino-3-(3-hydroxy-7,8-dihydro-6H-cyclohepta[d]isoxazol-4-yl)propionic acid and the 8-methyl analogue: synthesis, molecular pharmacology, and biostructural characterization. J Med Chem52:4911-22 (2009) 
 
Glutamate receptor ionotropic, kainate 1
Name:Glutamate receptor ionotropic, kainate 1
Type:Enzyme Catalytic Domain
Mol. Mass.:107860.82
Organism:RAT
Description:P22756
Residue:949
BDBM50126763
NameBDBM50126763
Synonyms:(S)-2-amino-3-(3-hydroxy-5-tert-butyl-4-isoxazolyl)propionic acid CHEMBL27130
TypeSmall organic molecule
Emp. Form.C10H16N2O4
Mol. Mass.228.245
SMILESCC(C)(C)c1o[nH]c(=O)c1C[C@H](N)C(O)=O