Reaction Details
TargetDelta-type opioid receptor
LigandBDBM50295072
Substrate/Competitorn/a
Meas. Tech.ChEMBL_573426 (CHEMBL1061321)
EC50 7.9±n/a nM
Citation Yamamoto, TNair, PJacobsen, NEVagner, JKulkarni, VDavis, PMa, SWNavratilova, EYamamura, HIVanderah, TWPorreca, FLai, JHruby, VJ Improving metabolic stability by glycosylation: bifunctional peptide derivatives that are opioid receptor agonists and neurokinin 1 receptor antagonists. J Med Chem52:5164-75 (2010) 
 
Delta-type opioid receptor
Name:Delta-type opioid receptor
Type:G Protein-Coupled Receptor (GPCR)
Mol. Mass.:40382.98
Organism:Homo sapiens (Human)
Description:Competition binding assays were carried out using membrane preparations from transfected HN9.10 cells that constitutively expressed the delta opioid receptor.
Residue:372
BDBM50295072
NameBDBM50295072
Synonyms:(S)-1-((2S,5S,11R,14S)-14-amino-5-benzyl-2-butyl-15-(4-hydroxyphenyl)-11-methyl-4,7,10,13-tetraoxo-3,6,9,12-tetraazapentadecane)-N-((S)-1-((S)-1-(3,5-bis(trifluoromethyl)benzylamino)-3-(1H-indol-3-yl)-1-oxopropan-2-ylamino)-1-oxo-3-((2R,3R,4S,5S,6R)-3,4,5-trihydroxy-6-(hydroxymethyl)tetrahydro-2H-pyran-2-yloxy)propan-2-yl)pyrrolidine-2-carboxamide | CHEMBL539193
TypeSmall organic molecule
Emp. Form.C63H76F6N10O15
Mol. Mass.1327.326
SMILESCCCC[C@H](NC(=O)[C@H](Cc1ccccc1)NC(=O)CNC(=O)[C@@H](C)NC(=O)[C@@H](N)Cc1ccc(O)cc1)C(=O)N1CCC[C@H]1C(=O)N[C@@H](CO[C@@H]1O[C@H](CO)[C@@H](O)[C@H](O)[C@H]1O)C(=O)N[C@@H](Cc1c[nH]c2ccccc12)C(=O)NCc1cc(cc(c1)C(F)(F)F)C(F)(F)F