Reaction Details
TargetDelta-type opioid receptor
LigandBDBM21014
Substrate/Competitorn/a
Meas. Tech.ChEMBL_573491 (CHEMBL1063044)
IC50 2.7±n/a nM
Citation Yamamoto, TNair, PJacobsen, NEVagner, JKulkarni, VDavis, PMa, SWNavratilova, EYamamura, HIVanderah, TWPorreca, FLai, JHruby, VJ Improving metabolic stability by glycosylation: bifunctional peptide derivatives that are opioid receptor agonists and neurokinin 1 receptor antagonists. J Med Chem52:5164-75 (2010) 
 
Delta-type opioid receptor
Name:Delta-type opioid receptor
Type:Enzyme Catalytic Domain
Mol. Mass.:40577.25
Organism:MOUSE
Description:P32300
Residue:372
BDBM21014
NameBDBM21014
Synonyms:(2S)-2-amino-N-[(1R)-1-[({[(1S)-1-{N'-[(2S)-2-{2-[(2R)-2-[(2S)-2-amino-3-(4-hydroxyphenyl)propanamido]propanamido]acetamido}-3-phenylpropanoyl]hydrazinecarbonyl}-2-phenylethyl]carbamoyl}methyl)carbamoyl]ethyl]-3-(4-hydroxyphenyl)propanamide Biphalin bis(Tyr-Ala-Gly-PheNH2)hydrazide | enkephalin dimer
TypeAnalgesics
Emp. Form.C46H56N10O10
Mol. Mass.908.9978
SMILESC[C@@H](NC(=O)[C@@H](N)Cc1ccc(O)cc1)C(=O)NCC(=O)N[C@@H](Cc1ccccc1)C(=O)NNC(=O)[C@H](Cc1ccccc1)NC(=O)CNC(=O)[C@@H](C)NC(=O)[C@@H](N)Cc1ccc(O)cc1