Reaction Details
TargetVasopressin V1b receptor
LigandBDBM50299348
Substrate/Competitorn/a
Meas. Tech.ChEMBL_590267 (CHEMBL1052802)
Ki 295±n/a nM
Citation Scott, JDMiller, MWLi, SWLin, SIVaccaro, HAHong, LMullins, DEGuzzi, MWeinstein, JHodgson, RAVarty, GBStamford, AWChan, TYMcKittrick, BAGreenlee, WJPriestley, TParker, EM Tetrahydroquinoline sulfonamides as vasopressin 1b receptor antagonists. Bioorg Med Chem Lett19:6018-22 (2009) 
 
Vasopressin V1b receptor
Name:Vasopressin V1b receptor
Type:Enzyme
Mol. Mass.:46985.01
Organism:Homo sapiens (Human)
Description:P47901
Residue:424
BDBM50299348
NameBDBM50299348
Synonyms:CHEMBL574450 | N-((1-(4-chlorophenylsulfonyl)-1,2,3,4-tetrahydroquinolin-2-yl)methyl)-N-methyl-4-(thiophen-2-ylmethylamino)piperidine-1-carboxamide
TypeSmall organic molecule
Emp. Form.C28H33ClN4O3S2
Mol. Mass.573.17
SMILESCN(CC1CCc2ccccc2N1S(=O)(=O)c1ccc(Cl)cc1)C(=O)N1CCC(CC1)NCc1cccs1