Reaction Details
TargetVasopressin V1b receptor
LigandBDBM50299352
Substrate/Competitorn/a
Meas. Tech.ChEMBL_590267 (CHEMBL1052802)
Ki 218±n/a nM
Citation Scott, JDMiller, MWLi, SWLin, SIVaccaro, HAHong, LMullins, DEGuzzi, MWeinstein, JHodgson, RAVarty, GBStamford, AWChan, TYMcKittrick, BAGreenlee, WJPriestley, TParker, EM Tetrahydroquinoline sulfonamides as vasopressin 1b receptor antagonists. Bioorg Med Chem Lett19:6018-22 (2009) 
 
Vasopressin V1b receptor
Name:Vasopressin V1b receptor
Type:Enzyme
Mol. Mass.:46985.01
Organism:Homo sapiens (Human)
Description:P47901
Residue:424
BDBM50299352
NameBDBM50299352
Synonyms:1-(2-(1-(2,4-dimethoxyphenylsulfonyl)-1,2,3,4-tetrahydroquinolin-2-yl)ethylsulfonyl)-N-(4-fluorobenzyl)piperidin-4-amine | CHEMBL572760
TypeSmall organic molecule
Emp. Form.C31H38FN3O6S2
Mol. Mass.631.778
SMILESCOc1ccc(c(OC)c1)S(=O)(=O)N1C(CCS(=O)(=O)N2CCC(CC2)NCc2ccc(F)cc2)CCc2ccccc12