Reaction Details
TargetVasopressin V1b receptor
LigandBDBM50299359
Substrate/Competitorn/a
Meas. Tech.ChEMBL_590268 (CHEMBL1052803)
Ki 62±n/a nM
Citation Scott, JDMiller, MWLi, SWLin, SIVaccaro, HAHong, LMullins, DEGuzzi, MWeinstein, JHodgson, RAVarty, GBStamford, AWChan, TYMcKittrick, BAGreenlee, WJPriestley, TParker, EM Tetrahydroquinoline sulfonamides as vasopressin 1b receptor antagonists. Bioorg Med Chem Lett19:6018-22 (2009) 
 
Vasopressin V1b receptor
Name:Vasopressin V1b receptor
Type:Enzyme Catalytic Domain
Mol. Mass.:47104.48
Organism:RAT
Description:VASOPRESSIN V1B AVPR1B RAT::P48974
Residue:425
BDBM50299359
NameBDBM50299359
Synonyms:CHEMBL575797 | N-(cyclopropylmethyl)-1-(2-(1-(2,4-dimethoxyphenylsulfonyl)-1,2,3,4-tetrahydroquinolin-2-yl)ethylsulfonyl)piperidin-4-amine
TypeSmall organic molecule
Emp. Form.C28H39N3O6S2
Mol. Mass.577.756
SMILESCOc1ccc(c(OC)c1)S(=O)(=O)N1C(CCS(=O)(=O)N2CCC(CC2)NCC2CC2)CCc2ccccc12