Reaction Details
TargetVasopressin V1a receptor
LigandBDBM50299342
Substrate/Competitorn/a
Meas. Tech.ChEMBL_590269 (CHEMBL1052804)
Ki 314±n/a nM
Citation Scott, JDMiller, MWLi, SWLin, SIVaccaro, HAHong, LMullins, DEGuzzi, MWeinstein, JHodgson, RAVarty, GBStamford, AWChan, TYMcKittrick, BAGreenlee, WJPriestley, TParker, EM Tetrahydroquinoline sulfonamides as vasopressin 1b receptor antagonists. Bioorg Med Chem Lett19:6018-22 (2009) 
 
Vasopressin V1a receptor
Name:Vasopressin V1a receptor
Type:Receptor
Mol. Mass.:46820.18
Organism:Homo sapiens (Human)
Description:P37288
Residue:418
BDBM50299342
NameBDBM50299342
Synonyms:CHEMBL1204126 CHEMBL572709 | N-(cyclohexylmethyl)-1-(2-(1-(2,4-dimethoxyphenylsulfonyl)-1,2,3,4-tetrahydroquinolin-2-yl)ethylsulfonyl)piperidin-4-amine
TypeSmall organic molecule
Emp. Form.C31H45N3O6S2
Mol. Mass.619.836
SMILESCOc1ccc(c(OC)c1)S(=O)(=O)N1C(CCS(=O)(=O)N2CCC(CC2)NCC2CCCCC2)CCc2ccccc12