Reaction Details
TargetCarbonic anhydrase 2
LigandBDBM10880
Substrate/Competitorn/a
Meas. Tech.ChEMBL_592385 (CHEMBL1036958)
Ki 12±n/a nM
Citation Lopez, MPaul, BHofmann, AMorizzi, JWu, QKCharman, SAInnocenti, AVullo, DSupuran, CTPoulsen, SA S-glycosyl primary sulfonamides--a new structural class for selective inhibition of cancer-associated carbonic anhydrases. J Med Chem52:6421-32 (2009) 
 
Carbonic anhydrase 2
Name:Carbonic anhydrase 2
Type:Enzyme
Mol. Mass.:29250.71
Organism:Homo sapiens (Human)
Description:P00918
Residue:260
BDBM10880
NameBDBM10880
Synonyms:AZA AZM acetazolamide Acetazolamide Acetazolamide (AZA) Acetazolamide, 5 Acetazolamide, AZA CHEMBL20 Sulfonamide, 1 US11278534, Example acetazolamide sulfonamide 1
TypeSmall organic molecule
Emp. Form.C4H6N4O3S2
Mol. Mass.222.245
SMILESCC(=O)Nc1nnc(s1)S(N)(=O)=O