Reaction Details
TargetCarbonic anhydrase 9
LigandBDBM50299574
Substrate/Competitorn/a
Meas. Tech.ChEMBL_592386 (CHEMBL1036959)
Ki 4090±n/a nM
Citation Lopez, MPaul, BHofmann, AMorizzi, JWu, QKCharman, SAInnocenti, AVullo, DSupuran, CTPoulsen, SA S-glycosyl primary sulfonamides--a new structural class for selective inhibition of cancer-associated carbonic anhydrases. J Med Chem52:6421-32 (2009) 
 
Carbonic anhydrase 9
Name:Carbonic anhydrase 9
Type:Enzyme
Mol. Mass.:49669.03
Organism:Homo sapiens (Human)
Description:Catalytic domain of human cloned isozyme was used in the assay
Residue:459
BDBM50299574
NameBDBM50299574
Synonyms:(2R,3S,4S,5R,6S)-2-(acetoxymethyl)-6-sulfamoyltetrahydro-2H-pyran-3,4,5-triyl triacetate | CHEMBL579226
TypeSmall organic molecule
Emp. Form.C14H21NO11S
Mol. Mass.411.382
SMILESCC(=O)OC[C@H]1O[C@H]([C@H](OC(C)=O)[C@@H](OC(C)=O)[C@H]1OC(C)=O)S(N)(=O)=O