Reaction Details
TargetCarbonic anhydrase 1
LigandBDBM50299575
Substrate/Competitorn/a
Meas. Tech.ChEMBL_592384 (CHEMBL1036957)
Ki 4340±n/a nM
Citation Lopez, MPaul, BHofmann, AMorizzi, JWu, QKCharman, SAInnocenti, AVullo, DSupuran, CTPoulsen, SA S-glycosyl primary sulfonamides--a new structural class for selective inhibition of cancer-associated carbonic anhydrases. J Med Chem52:6421-32 (2009) 
 
Carbonic anhydrase 1
Name:Carbonic anhydrase 1
Type:Enzyme
Mol. Mass.:28873.37
Organism:Homo sapiens (Human)
Description:P00915
Residue:261
BDBM50299575
NameBDBM50299575
Synonyms:(2S,3S,4S,5R,6S)-2-(methoxycarbonyl)-6-sulfamoyltetrahydro-2H-pyran-3,4,5-triyl triacetate | CHEMBL584312
TypeSmall organic molecule
Emp. Form.C13H19NO11S
Mol. Mass.397.355
SMILESCOC(=O)[C@H]1O[C@H]([C@H](OC(C)=O)[C@@H](OC(C)=O)[C@@H]1OC(C)=O)S(N)(=O)=O