Reaction Details
TargetCarbonic anhydrase 1
LigandBDBM50299577
Substrate/Competitorn/a
Meas. Tech.ChEMBL_592384 (CHEMBL1036957)
Ki 4120±n/a nM
Citation Lopez, MPaul, BHofmann, AMorizzi, JWu, QKCharman, SAInnocenti, AVullo, DSupuran, CTPoulsen, SA S-glycosyl primary sulfonamides--a new structural class for selective inhibition of cancer-associated carbonic anhydrases. J Med Chem52:6421-32 (2009) 
 
Carbonic anhydrase 1
Name:Carbonic anhydrase 1
Type:Enzyme
Mol. Mass.:28873.37
Organism:Homo sapiens (Human)
Description:P00915
Residue:261
BDBM50299577
NameBDBM50299577
Synonyms:(2R,3R,4S,5R,6R)-2-(acetoxymethyl)-6-((2R,3R,4S,5R,6S)-4,5-diacetoxy-2-(acetoxymethyl)-6-sulfamoyltetrahydro-2H-pyran-3-yloxy)tetrahydro-2H-pyran-3,4,5-triyl triacetate | CHEMBL573460
TypeSmall organic molecule
Emp. Form.C26H37NO19S
Mol. Mass.699.632
SMILESCC(=O)OC[C@H]1O[C@H](O[C@@H]2[C@@H](COC(C)=O)O[C@H]([C@H](OC(C)=O)[C@H]2OC(C)=O)S(N)(=O)=O)[C@H](OC(C)=O)[C@@H](OC(C)=O)[C@@H]1OC(C)=O