Reaction Details
TargetCarbonic anhydrase 12
LigandBDBM50299579
Substrate/Competitorn/a
Meas. Tech.ChEMBL_592387 (CHEMBL1036960)
Ki 4800±n/a nM
Citation Lopez, MPaul, BHofmann, AMorizzi, JWu, QKCharman, SAInnocenti, AVullo, DSupuran, CTPoulsen, SA S-glycosyl primary sulfonamides--a new structural class for selective inhibition of cancer-associated carbonic anhydrases. J Med Chem52:6421-32 (2009) 
 
Carbonic anhydrase 12
Name:Carbonic anhydrase 12
Type:Enzyme
Mol. Mass.:39456.00
Organism:Homo sapiens (Human)
Description:Catalytic domain of human cloned isozyme was used in the assay
Residue:354
BDBM50299579
NameBDBM50299579
Synonyms:(2S,3R,4S,5R,6R)-3,4,5-trihydroxy-6-(hydroxymethyl)oxane-2-sulfonamide CHEMBL569412
TypeSmall organic molecule
Emp. Form.C6H13NO7S
Mol. Mass.243.235
SMILESNS(=O)(=O)[C@@H]1O[C@H](CO)[C@H](O)[C@H](O)[C@H]1O