Reaction Details
TargetAcetylcholinesterase
LigandBDBM7462
Substrate/Competitorn/a
Meas. Tech.ChEMBL_592838 (CHEMBL1045781)
Ki 92800±n/a nM
Citation Katalinic, MRusak, GDomacinovic Barovic, JSinko, GJelic, DAntolovic, RKovarik, Z Structural aspects of flavonoids as inhibitors of human butyrylcholinesterase. Eur J Med Chem45:186-92 (2010) 
 
Acetylcholinesterase
Name:Acetylcholinesterase
Type:Enzyme
Mol. Mass.:67792.70
Organism:Homo sapiens (Human)
Description:P22303
Residue:614
BDBM7462
NameBDBM7462
Synonyms:3,5,7-trihydroxy-2-(4-hydroxyphenyl)-4H-chromen-4-one CHEMBL150 Kaempferol (Kmp) kaempferol
TypeSmall organic molecule
Emp. Form.C15H10O6
Mol. Mass.286.2363
SMILESOc1ccc(cc1)-c1oc2cc(O)cc(O)c2c(=O)c1O