Reaction Details
TargetAcetylcholinesterase
LigandBDBM15236
Substrate/Competitorn/a
Meas. Tech.ChEMBL_592838 (CHEMBL1045781)
Ki 37800±n/a nM
Citation Katalinic, MRusak, GDomacinovic Barovic, JSinko, GJelic, DAntolovic, RKovarik, Z Structural aspects of flavonoids as inhibitors of human butyrylcholinesterase. Eur J Med Chem45:186-92 (2010) 
 
Acetylcholinesterase
Name:Acetylcholinesterase
Type:Enzyme
Mol. Mass.:67792.70
Organism:Homo sapiens (Human)
Description:P22303
Residue:614
BDBM15236
NameBDBM15236
Synonyms:3,5,7-trihydroxy-2-(3,4,5-trihydroxyphenyl)-4H-chromen-4-one CHEMBL164 Myricetin Myricetin (Myr) | cid_5281672
TypeSmall organic molecule
Emp. Form.C15H10O8
Mol. Mass.318.2351
SMILESOc1cc(O)c2c(c1)oc(-c1cc(O)c(O)c(O)c1)c(O)c2=O