Reaction Details
TargetDNA gyrase subunit B
LigandBDBM50378435
Substrate/Competitorn/a
Meas. Tech.ChEMBL_598030 (CHEMBL1046299)
IC50 198±n/a nM
Citation Starr, JTSciotti, RJHanna, DLHuband, MDMullins, LMCai, HGage, JWLockard, MRauckhorst, MROwen, RMLall, MSTomilo, MChen, HMcCurdy, SPBarbachyn, MR 5-(2-Pyrimidinyl)-imidazo[1,2-a]pyridines are antibacterial agents targeting the ATPase domains of DNA gyrase and topoisomerase IV. Bioorg Med Chem Lett19:5302-6 (2009) 
 
DNA gyrase subunit B
Name:DNA gyrase subunit B
Type:PROTEIN
Mol. Mass.:72222.52
Organism:Streptococcus pneumoniae
Description:ChEMBL_598030
Residue:648
BDBM50378435
NameBDBM50378435
Synonyms:CHEMBL578336
TypeSmall organic molecule
Emp. Form.C21H21N7O
Mol. Mass.387.4377
SMILESCCNC(=O)Nc1cn2c(cc(cc2n1)-c1cccnc1)-c1nc(C)cc(C)n1