Reaction Details
TargetDNA gyrase subunit B
LigandBDBM50378448
Substrate/Competitorn/a
Meas. Tech.ChEMBL_598030 (CHEMBL1046299)
IC50 137±n/a nM
Citation Starr, JTSciotti, RJHanna, DLHuband, MDMullins, LMCai, HGage, JWLockard, MRauckhorst, MROwen, RMLall, MSTomilo, MChen, HMcCurdy, SPBarbachyn, MR 5-(2-Pyrimidinyl)-imidazo[1,2-a]pyridines are antibacterial agents targeting the ATPase domains of DNA gyrase and topoisomerase IV. Bioorg Med Chem Lett19:5302-6 (2009) 
 
DNA gyrase subunit B
Name:DNA gyrase subunit B
Type:PROTEIN
Mol. Mass.:72222.52
Organism:Streptococcus pneumoniae
Description:ChEMBL_598030
Residue:648
BDBM50378448
NameBDBM50378448
Synonyms:CHEMBL577041
TypeSmall organic molecule
Emp. Form.C20H21N9O
Mol. Mass.403.4404
SMILESCCNC(=O)Nc1cn2c(cc(cc2n1)-c1cnc(nc1)N(C)C)-c1ncccn1