Reaction Details
TargetDNA topoisomerase (ATP-hydrolyzing)
LigandBDBM50378428
Substrate/Competitorn/a
Meas. Tech.ChEMBL_598031 (CHEMBL1046300)
IC50 265±n/a nM
Citation Starr, JTSciotti, RJHanna, DLHuband, MDMullins, LMCai, HGage, JWLockard, MRauckhorst, MROwen, RMLall, MSTomilo, MChen, HMcCurdy, SPBarbachyn, MR 5-(2-Pyrimidinyl)-imidazo[1,2-a]pyridines are antibacterial agents targeting the ATPase domains of DNA gyrase and topoisomerase IV. Bioorg Med Chem Lett19:5302-6 (2009) 
 
DNA topoisomerase (ATP-hydrolyzing)
Name:DNA topoisomerase (ATP-hydrolyzing)
Synonyms:ParE
Type:PROTEIN
Mol. Mass.:70593.66
Organism:Streptococcus pneumoniae
Description:ChEMBL_598031
Residue:638
BDBM50378428
NameBDBM50378428
Synonyms:CHEMBL578120
TypeSmall organic molecule
Emp. Form.C21H21N7O
Mol. Mass.387.4377
SMILESCCNC(=O)Nc1cn2c(cc(cc2n1)-c1cccnc1)-c1ncc(CC)cn1