Reaction Details
TargetParathyroid hormone/parathyroid hormone-related peptide receptor
LigandBDBM50301952
Substrate/Competitorn/a
Meas. Tech.ChEMBL_598678 (CHEMBL1050759)
IC50>10000±n/a nM
Citation Mapelli, CNatarajan, SIMeyer, JPBastos, MMBernatowicz, MSLee, VGPluscec, JRiexinger, DJSieber-McMaster, ESConstantine, KLSmith-Monroy, CAGolla, RMa, ZLonghi, DAShi, DXin, LTaylor, JRKoplowitz, BChi, CLKhanna, ARobinson, GWSeethala, RAntal-Zimanyi, IAStoffel, RHHan, SWhaley, JMHuang, CSKrupinski, JEwing, WR Eleven amino acid glucagon-like peptide-1 receptor agonists with antidiabetic activity. J Med Chem52:7788-99 (2009) 
 
Parathyroid hormone/parathyroid hormone-related peptide receptor
Name:Parathyroid hormone/parathyroid hormone-related peptide receptor
Type:Enzyme Catalytic Domain
Mol. Mass.:66370.95
Organism:Homo sapiens (Human)
Description:PARATHYROID HT1 0 HUMAN::Q03431
Residue:593
BDBM50301952
NameBDBM50301952
Synonyms:(3S,6S,9S,12S,15S,21S)-21-(2-((S)-2-amino-3-(1H-imidazol-5-yl)propanamido)-2-methylpropanamido)-3-((S)-1-((S)-1-amino-3-(2'-methylbiphenyl-4-yl)-1-oxopropan-2-ylamino)-3-(2'-ethyl-4'-methoxybiphenyl-4-yl)-1-oxopropan-2-ylcarbamoyl)-12-(2-fluorobenzyl)-9,15-bis((R)-1-hydroxyethyl)-6-(hydroxymethyl)-12-methyl-5,8,11,14,17,20-hexaoxo-4,7,10,13,16,19-hexaazatetracosane-1,24-dioic acid | CHEMBL577345
TypeSmall organic molecule
Emp. Form.C76H95FN14O19
Mol. Mass.1527.6483
SMILESCCc1cc(OC)ccc1-c1ccc(C[C@H](NC(=O)[C@H](CC(O)=O)NC(=O)[C@H](CO)NC(=O)[C@@H](NC(=O)[C@](C)(Cc2ccccc2F)NC(=O)[C@@H](NC(=O)CNC(=O)[C@H](CCC(O)=O)NC(=O)C(C)(C)NC(=O)[C@@H](N)Cc2cnc[nH]2)[C@@H](C)O)[C@@H](C)O)C(=O)N[C@@H](Cc2ccc(cc2)-c2ccccc2C)C(N)=O)cc1