Reaction Details
TargetProtein kinase C theta type
LigandBDBM50302051
Substrate/Competitorn/a
Meas. Tech.ChEMBL_599128 (CHEMBL1047183)
IC50 1.4±n/a nM
Citation Prashad, ASWang, DSubrath, JWu, BLin, MZhang, MYKagan, NLee, JYang, XBrennan, AChaudhary, DXu, XLeung, LWang, JBoschelli, DH C-5 substituted heteroaryl-3-pyridinecarbonitriles as PKCtheta inhibitors: part II. Bioorg Med Chem Lett19:5799-802 (2009) 
 
Protein kinase C theta type
Name:Protein kinase C theta type
Type:Serine/threonine-protein kinase
Mol. Mass.:81878.04
Organism:Homo sapiens (Human)
Description:Full-length human PKC theta (Panvera Catalog No. P2996).
Residue:706
BDBM50302051
NameBDBM50302051
Synonyms:5-(5-((cyclohexylamino)methyl)benzofuran-2-yl)-4-(4-methyl-1H-indol-5-ylamino)nicotinonitrile | CHEMBL569590
TypeSmall organic molecule
Emp. Form.C30H29N5O
Mol. Mass.475.5842
SMILESCc1c(Nc2c(cncc2-c2cc3cc(CNC4CCCCC4)ccc3o2)C#N)ccc2[nH]ccc12