Reaction Details
TargetProtein kinase C theta type
LigandBDBM50302035
Substrate/Competitorn/a
Meas. Tech.ChEMBL_599128 (CHEMBL1047183)
IC50 1.5±n/a nM
Citation Prashad, ASWang, DSubrath, JWu, BLin, MZhang, MYKagan, NLee, JYang, XBrennan, AChaudhary, DXu, XLeung, LWang, JBoschelli, DH C-5 substituted heteroaryl-3-pyridinecarbonitriles as PKCtheta inhibitors: part II. Bioorg Med Chem Lett19:5799-802 (2009) 
 
Protein kinase C theta type
Name:Protein kinase C theta type
Type:Serine/threonine-protein kinase
Mol. Mass.:81878.04
Organism:Homo sapiens (Human)
Description:Full-length human PKC theta (Panvera Catalog No. P2996).
Residue:706
BDBM50302035
NameBDBM50302035
Synonyms:5-(5-((2,3-dihydroxypropylamino)methyl)benzofuran-2-yl)-4-(4-methyl-1H-indol-5-ylamino)nicotinonitrile | CHEMBL585753
TypeSmall organic molecule
Emp. Form.C27H25N5O3
Mol. Mass.467.5191
SMILESCc1c(Nc2c(cncc2-c2cc3cc(CNCC(O)CO)ccc3o2)C#N)ccc2[nH]ccc12