Reaction Details
TargetProtein kinase C delta type
LigandBDBM50302038
Substrate/Competitorn/a
Meas. Tech.ChEMBL_599129 (CHEMBL1047184)
IC50 138±n/a nM
Citation Prashad, ASWang, DSubrath, JWu, BLin, MZhang, MYKagan, NLee, JYang, XBrennan, AChaudhary, DXu, XLeung, LWang, JBoschelli, DH C-5 substituted heteroaryl-3-pyridinecarbonitriles as PKCtheta inhibitors: part II. Bioorg Med Chem Lett19:5799-802 (2009) 
 
Protein kinase C delta type
Name:Protein kinase C delta type
Type:Enzyme
Mol. Mass.:77516.79
Organism:Homo sapiens (Human)
Description:The recombinant human PKC enzymes were produced using a baculovirus expression system in SF9 cells
Residue:676
BDBM50302038
NameBDBM50302038
Synonyms:4-(4-methyl-1H-indol-5-ylamino)-5-(5-((4-(methylsulfonyl)piperazin-1-yl)methyl)benzofuran-2-yl)nicotinonitrile | CHEMBL568923
TypeSmall organic molecule
Emp. Form.C29H28N6O3S
Mol. Mass.540.636
SMILESCc1c(Nc2c(cncc2-c2cc3cc(CN4CCN(CC4)S(C)(=O)=O)ccc3o2)C#N)ccc2[nH]ccc12