Reaction Details
TargetProtein kinase C theta type
LigandBDBM50302041
Substrate/Competitorn/a
Meas. Tech.ChEMBL_599128 (CHEMBL1047183)
IC50 6.1±n/a nM
Citation Prashad, ASWang, DSubrath, JWu, BLin, MZhang, MYKagan, NLee, JYang, XBrennan, AChaudhary, DXu, XLeung, LWang, JBoschelli, DH C-5 substituted heteroaryl-3-pyridinecarbonitriles as PKCtheta inhibitors: part II. Bioorg Med Chem Lett19:5799-802 (2009) 
 
Protein kinase C theta type
Name:Protein kinase C theta type
Type:Serine/threonine-protein kinase
Mol. Mass.:81878.04
Organism:Homo sapiens (Human)
Description:Full-length human PKC theta (Panvera Catalog No. P2996).
Residue:706
BDBM50302041
NameBDBM50302041
Synonyms:5-(5-((4-methoxypiperazin-1-yl)methyl)benzofuran-2-yl)-4-(4-methyl-1H-indol-5-ylamino)nicotinonitrile | CHEMBL570924
TypeSmall organic molecule
Emp. Form.C29H28N6O2
Mol. Mass.492.5716
SMILESCc1c(Nc2c(cncc2-c2cc3cc(CN4CC[N+](C)([O-])CC4)ccc3o2)C#N)ccc2[nH]ccc12