Reaction Details
TargetHistone deacetylase 1
LigandBDBM50302077
Substrate/Competitorn/a
Meas. Tech.ChEMBL_599171 (CHEMBL1049814)
IC50 26±n/a nM
Citation Olsen, CAGhadiri, MR Discovery of potent and selective histone deacetylase inhibitors via focused combinatorial libraries of cyclic alpha3beta-tetrapeptides. J Med Chem52:7836-46 (2009) 
 
Histone deacetylase 1
Name:Histone deacetylase 1
Type:Enzyme
Mol. Mass.:55090.27
Organism:Homo sapiens (Human)
Description:Q13547
Residue:482
BDBM50302077
NameBDBM50302077
Synonyms:(3S,6S,9S,13S)-3-((1H-indol-3-yl)methyl)-13-isobutyl-9-methyl-6-(6-oxooctyl)-1,4,7,10-tetraazacyclotridecane-2,5,8,11-tetraone | CHEMBL583130
TypeSmall organic molecule
Emp. Form.C31H45N5O5
Mol. Mass.567.7195
SMILESCCC(=O)CCCCC[C@@H]1NC(=O)[C@H](C)NC(=O)C[C@H](CC(C)C)NC(=O)[C@H](Cc2c[nH]c3ccccc23)NC1=O