Reaction Details
TargetHistone deacetylase 1
LigandBDBM50302053
Substrate/Competitorn/a
Meas. Tech.ChEMBL_599171 (CHEMBL1049814)
IC50 20±n/a nM
Citation Olsen, CAGhadiri, MR Discovery of potent and selective histone deacetylase inhibitors via focused combinatorial libraries of cyclic alpha3beta-tetrapeptides. J Med Chem52:7836-46 (2009) 
 
Histone deacetylase 1
Name:Histone deacetylase 1
Type:Enzyme
Mol. Mass.:55090.27
Organism:Homo sapiens (Human)
Description:Q13547
Residue:482
BDBM50302053
NameBDBM50302053
Synonyms:(3S,6R,9S,13S)-3-((1H-indol-3-yl)methyl)-13-isobutyl-9-methyl-6-((4-oxohexylthio)methyl)-1,4,7,10-tetraazacyclotridecane-2,5,8,11-tetraone | CHEMBL569812
TypeSmall organic molecule
Emp. Form.C30H43N5O5S
Mol. Mass.585.758
SMILESCCC(=O)CCCSC[C@@H]1NC(=O)[C@H](C)NC(=O)C[C@H](CC(C)C)NC(=O)[C@H](Cc2c[nH]c3ccccc23)NC1=O