Reaction Details
TargetHistone deacetylase 1
LigandBDBM50302059
Substrate/Competitorn/a
Meas. Tech.ChEMBL_599171 (CHEMBL1049814)
IC50 8±n/a nM
Citation Olsen, CAGhadiri, MR Discovery of potent and selective histone deacetylase inhibitors via focused combinatorial libraries of cyclic alpha3beta-tetrapeptides. J Med Chem52:7836-46 (2009) 
 
Histone deacetylase 1
Name:Histone deacetylase 1
Type:Enzyme
Mol. Mass.:55090.27
Organism:Homo sapiens (Human)
Description:Q13547
Residue:482
BDBM50302059
NameBDBM50302059
Synonyms:6-((2S,5S,8S,11S)-2-(5-acetamidopentyl)-11-isobutyl-8-(naphthalen-1-ylmethyl)-3,6,9,13-tetraoxo-1,4,7,10-tetraazacyclotridecan-5-yl)hexanoic acid | CHEMBL569174
TypeSmall organic molecule
Emp. Form.C37H53N5O7
Mol. Mass.679.846
SMILESCC(C)C[C@H]1CC(=O)N[C@@H](CCCCCNC(C)=O)C(=O)N[C@@H](CCCCCC(O)=O)C(=O)N[C@@H](Cc2cccc3ccccc23)C(=O)N1